{"text_format":"1","workbook":"xlsx","n_sheets":3,"sheets":["Форма","Инструкция","Справочники"],"not_rendered":{"charts":0,"images":0,"macros":1,"external_links":0,"defined_names":1,"comments":0,"pivot_tables":0},"unopened":[],"bounds":{"document_bytes":16777216,"sheet_cells":100000,"rows_first":2000,"rows_last":500,"rows_between":2000,"halvings":0,"cell_chars":16384,"cell_head_chars":4096},"cells_cut":0,"cells_raw":0,"read":"whole","date_system":"1900"}

{"sheet":"Форма","index":0,"n_rows":63,"n_cols":7,"rows_kept":63,"cut":false,"hidden":false,"merged":[[20,4,20,5],[31,0,31,2],[21,0,21,1],[21,4,21,5],[27,0,27,2],[27,3,27,4],[22,4,22,5],[32,0,32,2],[32,3,32,4],[29,0,29,5],[25,0,25,2],[26,0,26,2],[45,2,45,4],[8,1,8,3],[54,0,54,5],[16,1,16,5],[12,0,12,5],[47,0,47,6],[13,0,13,1],[13,2,13,5],[17,1,17,5],[35,0,35,2],[30,0,30,2],[20,0,20,1],[24,0,24,5],[19,0,19,5],[53,0,53,4],[22,0,22,1],[7,0,7,3],[1,0,1,5],[2,0,2,5],[3,0,3,5],[52,0,52,5],[42,0,42,5],[43,2,43,4],[44,2,44,4],[34,0,34,5],[35,3,35,5],[9,1,9,3],[15,0,15,4],[25,3,25,4],[26,3,26,4],[30,3,30,4],[31,3,31,4]]}
[]
["ОТЧЕТ"]
["О фактическом исполнении контрактов на поставку товаров на экспорт \nи результатах мониторинга неприменения механизма фиксации предельной цены до конечного покупателя"]
["Настоящий отчет представлен во исполнение абзаца 5 подпункта «б» пункта 2 Правил осуществления мониторинга исполнения пункта 1 Указа Президента Российской Федерации от 27 декабря 2022 г. № 961 «О применении специальных экономических мер в топливно-энергетической сфере в связи с установлением некоторыми иностранными государствами предельной цены на российские нефть и нефтепродукты», утвержденных постановлением Правительства Российской Федерации от 28 января 2023 г. № 118 (далее – постановление № 118), в отношении товаров, классифицируемых в товарных позициях 2709 00 900 ТН ВЭД ЕАЭС (далее – товары)."]
[]
["Период отчета","январь","2023 г."]
[]
["Должностное лицо, ответственное за заполнение формы"]
["Фамилия, имя, отчество"]
["Должность:"]
["Контактный телефон:",null,"e-mail:"]
[]
["1. Информация об организации-респонденте"]
["1.1 Наименование юридического/физического лица"]
["1.2 ОКПО",null,"1.3 ИНН",null,"1.4 КПП"]
["1.5 Идентификатор головного/обособленного подразделения (Пункт  заполняется только в случае, если вы являетесь обособленным подразделением)"]
["1.6 Юридический адрес"]
["1.7 Почтовый адрес"]
[]
["2. Информация о фактически исполненных контрактах, в том числе в разрезе условий поставок"]
["2.1 Базисы поставок",null,"2.2 Количество контрактов, ед.","2.3 Количество товаров, тыс. т","2.4 Примечание"]
[null,null,0,0]
[null,null,0,0]
[]
["3. Информация об организациях, оказавших услуги по страхованию товаров, с указанием стран их нахождения"]
["3.1 Наименование страховой организации",null,null,"3.2 Страна регистрации",null,"3.3 Код страны регистрации"]
[null,null,null,null,null,{"$f":"INDEX(Справочники!$G$5:$G$254,MATCH(Форма!D27,Справочники!$E$5:$E$254,0))","v":{"$error":"#N/A"}}]
[null,null,null,null,null,{"$f":"INDEX(Справочники!$G$5:$G$254,MATCH(Форма!D28,Справочники!$E$5:$E$254,0))","v":{"$error":"#N/A"}}]
[]
["4. Информация об организациях, оказавших услуги по страхованию ответственности судовладельцев, с указанием стран их нахождения"]
["4.1 Наименование страховой организации",null,null,"4.2 Страна регистрации",null,"4.3 Код страны регистрации"]
[null,null,null,null,null,{"$f":"INDEX(Справочники!$G$5:$G$254,MATCH(Форма!D32,Справочники!$E$5:$E$254,0))","v":{"$error":"#N/A"}}]
[null,null,null,null,null,{"$f":"INDEX(Справочники!$G$5:$G$254,MATCH(Форма!D33,Справочники!$E$5:$E$254,0))","v":{"$error":"#N/A"}}]
[]
["5. Количество товаров, поставленных в рамках контрактов, по видам транспорта"]
["5.1 до таможенной границы",null,null,"5.2 после таможенной границы"]
["Вид транспорта","Код  вида транспорта","Количество, тыс. т","Вид транспорта","Код  вида транспорта","Количество, тыс. т"]
["Морской/речной",10,0,"Морской/речной",10,0]
["Железнодорожный",20,0,"Железнодорожный",20,0]
["Автомобильный ",30,0,"Автомобильный ",30,0]
["Трубопроводный",71,0,"Трубопроводный",71,0]
[]
["6. Количество товаров, поставленных в разрезе стран назначения и покупателей товаров, с точностью до сотых"]
["6.1 Страна назначения","6.2 Код страны назначения","6.3 Наименование организации покупателей товаров",null,null,"6.4 Количество, тыс. т"]
[null,{"$f":"INDEX(Справочники!$G$5:$G$254,MATCH(Форма!A45,Справочники!$E$5:$E$254,0))","v":{"$error":"#N/A"}},null,null,null,0]
[null,{"$f":"INDEX(Справочники!$G$5:$G$254,MATCH(Форма!A46,Справочники!$E$5:$E$254,0))","v":{"$error":"#N/A"}},null,null,null,0]
[]
["7. Информация о товарах, поставленных в рамках контрактов и убывших с территории Российской Федерации морским транспортом, в разрезе портов Российской Федерации \nс указанием затрат на страхование и стоимости фрахта до соответствующих стран выгрузки товаров, с точностью до сотых"]
["7.1 Наименование порта РФ","7.2 Код порта РФ","7.3 Страна назначения","7.4 Код страны назначения","7.5 Количество товара, тыс. т","7.6 Удельные затраты на страхование, $/барр.","7.7 Удельная стоимость фрахта судна до страны прибытия, $/барр."]
[null,{"$f":"INDEX(Справочники!$C$5:$C$62,MATCH(Форма!A50,Справочники!$B$5:$B$62,0))","v":{"$error":"#N/A"}},null,{"$f":"INDEX(Справочники!$G$5:$G$254,MATCH(Форма!C50,Справочники!$E$5:$E$254,0))","v":{"$error":"#N/A"}},0,0,0]
[null,{"$f":"INDEX(Справочники!$C$5:$C$62,MATCH(Форма!A51,Справочники!$B$5:$B$62,0))","v":{"$error":"#N/A"}},null,{"$f":"INDEX(Справочники!$G$5:$G$254,MATCH(Форма!C51,Справочники!$E$5:$E$254,0))","v":{"$error":"#N/A"}},0,0,0]
[]
["8. Результаты мониторинга неприменения механизма фиксации предельной цены до конечного покупателя, предусмотренного абзацем третьим подпункта «б» пункта 2 постановления №118"]
["8.1 Выявлена ли в ходе мониторинга информация о применении механизма фиксации предельной цены на товары до конечного покупателя?"]
["Графы 8.2-8.7 заполняются только в случае выбора положительного ответа в поле графы 8.1"]
["8.2 Наименование производителя товара","8.3 Наименование организации или лица, применившего механизм фиксации предельной цены на товары","8.4 Страна назначения","8.5 Код страны назначения","8.6 Количество, тыс. т","8.7 Дата заключения соответствующего документа поставки товара "]
[null,null,null,{"$f":"INDEX(Справочники!$G$5:$G$254,MATCH(Форма!C57,Справочники!$E$5:$E$254,0))","v":{"$error":"#N/A"}},0,"2023-01-01"]
[null,null,null,{"$f":"INDEX(Справочники!$G$5:$G$254,MATCH(Форма!C58,Справочники!$E$5:$E$254,0))","v":{"$error":"#N/A"}},0,"2023-01-01"]
[]
["Условные обозначения граф Формы:  "]
["          - поля, предназначенные для заполнения;  "]
["          - поля с автозаполнением; "]
["          - поля с выбором варианта из предлагаемого списка, активируемого щелчком мыши."]

{"sheet":"Инструкция","index":1,"n_rows":0,"n_cols":0,"rows_kept":0,"cut":false,"hidden":false,"merged":[]}

{"sheet":"Справочники","index":2,"n_rows":254,"n_cols":12,"rows_kept":254,"cut":false,"hidden":true,"merged":[[2,1,2,2],[2,4,2,6],[4,9,15,9],[16,9,19,9],[4,8,19,8]]}
[]
[]
[null,"Справочник портов РФ",null,null,"Классификатор стран мира Таможенного союза",null,null,null,"Международные торговые термины в области внешней торговли"]
[null,"Наименование","Код",null,"Краткое наименование","Наименование","Код",null,"Документы","Виды транспорта","Базисы поставок","Определения базисов поставок и версии Инкотермс, в которых они являются актуальными/действующими"]
[null,"Азов","RUAZO",null,"АБХАЗИЯ","Республика Абхазия","ABH",null,"Инкотермс","Любой","EXW","EXW — англ. ex works, франко-склад, франко-завод: товар забирается покупателем с указанного в договоре склада продавца, оплата экспортных пошлин вменяется в обязанность покупателю. Версия Инкотермс 2020."]
[null,"Александровск-Сахалинский","RUSAK",null,"АВСТРАЛИЯ","Австралия","AUS",null,null,null,"FCA","FCA — англ. free carrier, франко-перевозчик: товар доставляется основному перевозчику заказчика к указанному в договоре терминалу отправления, экспортные пошлины уплачивает продавец. Версия Инкотермс 2020."]
[null,"Амдерма","RUAMD",null,"АВСТРИЯ","Австрийская Республика","AUT",null,null,null,"CPT","CPT — англ. carriage paid to…: товар доставляется основному перевозчику заказчика, основную перевозку до указанного в договоре терминала прибытия оплачивает продавец, расходы по страховке несёт покупатель, импортную растаможку и доставку с терминала прибытия основного перевозчика осуществляет покупатель. Версия Инкотермс 2020."]
[null,"Анадырь","RUDYR",null,"АЗЕРБАЙДЖАН","Республика Азербайджан","AZE",null,null,null,"CIP","CIP — англ. carriage and insurance paid to…: то же, что CPT, но основная перевозка страхуется продавцом. Версия Инкотермс 2020."]
[null,"Архангельск","RUARH",null,"АЛБАНИЯ","Республика Албания","ALB",null,null,null,"DPU","DPU — англ. delivered named place unloaded: то же, что DAT, но поставка осуществляется не только до импортного таможенного терминала, а до любого места. В версии Инкотермс 2020 переименован из DAT."]
[null,"Астрахань","RUASF",null,"АЛЖИР","Алжирская Народная Демократическая Республика","DZA",null,null,null,"DAT","DAT — англ. delivered at terminal: поставка до указанного в договоре импортного таможенного терминала оплачена, то есть экспортные платежи и основную перевозку, включая страховку, оплачивает продавец, таможенная очистка по импорту осуществляется покупателем. В версии Инкотермс 2010 введён вместо DEQ, в версии Инкотермс 2020 переименован в DPU."]
[null,"Беломорск","RUBEM",null,"АМЕРИКАНСКОЕ САМОА","Американское Самоа","ASM",null,null,null,"DEQ","DEQ — англ. delivered ex quay: доставка, когда товары предоставлены в распоряжение покупателя не очищенными для импорта на пристани (причале) указанного порта назначения. Продавец несет все расходы и риски, связанные с доставкой товаров в указанный порт назначения и разгрузкой товаров на пристань (причал). Версия Инкотермс 2000, заменён в версии Инкотермс 2010 на DAT."]
[null,"Беринговский","RUBER",null,"АНГИЛЬЯ","Ангилья (Брит.)","AIA",null,null,null,"DAP","DAP — англ. delivered at place: поставка в место назначения, указанное в договоре, импортные пошлины и местные налоги оплачиваются покупателем. Версия Инкотермс 2020."]
[null,"Большой Камень","RUBKN",null,"АНГОЛА","Республика Ангола","AGO",null,null,null,"DAF","DAF — англ. delivered at frontier: продавец несёт обязанности по транспортировке товара до границы и оплате пошлин. Покупатель несёт обязанности и по таможенному оформлению товара, и по транспортировке с границы до своего местонахождения. Риски переходят в момент достижения грузом границы. Версия Инкотермс 2000, объединён в версии Инкотермс 2010 совместно с DES и DDU в DAP."]
[null,"Бошняково","RUBOS",null,"АНДОРРА","Княжество Андорра","AND",null,null,null,"DES","DES — англ. delivered ex ship: продавец считается выполнившим условия договора, когда он предоставил не прошедший таможенную очистку для импорта товар в распоряжение покупателя на борту судна в названном порту назначения. Продавец должен нести все расходы и риски по доставке товара в названный порт назначения до момента его разгрузки. Версия Инкотермс 2000, объединён в версии Инкотермс 2010 совместно с DAF и DDU в DAP."]
[null,"Ванино","RUVNN",null,"АНТАРКТИДА","Антарктида","ATA",null,null,null,"DDU","DDU — англ. delivered duty unpaid: поставка в место назначения; ответственность продавца заканчивается после того, как товар доставлен в указанное место в стране покупателя; все риски, все расходы по доставке груза, ответственность за порчу и потерю товара до этого момента несёт продавец; если покупатель не успел вовремя подготовить товар ко ввозу, он сам несёт за это ответственность. Версия Инкотермс 2000, объединён в версии Инкотермс 2010 совместно с DAF и DES в DAP."]
[null,"Витино","RUVIT",null,"АНТИГУА И БАРБУДА","Антигуа и Барбуда","ATG",null,null,null,"DDP","DDP — англ. delivered duty paid: товар доставляется заказчику в место назначения, указанное в договоре, очищенный от всех таможенных пошлин и рисков. Версия Инкотермс 2020."]
[null,"Владивосток","RUVVO",null,"АРГЕНТИНА","Аргентинская Республика","ARG",null,null,"Морской и территориальных вод","FAS","FAS — англ. free alongside ship: товар доставляется к судну покупателя, в договоре указывается порт погрузки, перевалку и погрузку оплачивает покупатель. Версия Инкотермс 2020."]
[null,"Восточный","RUVYP",null,"АРМЕНИЯ","Республика Армения","ARM",null,null,null,"FOB","FOB — англ. free on board: товар отгружается на судно покупателя, перевалку оплачивает продавец. Версия Инкотермс 2020."]
[null,"Выборг","RUVYG",null,"АРУБА","Аруба","ABW",null,null,null,"CFR","CFR — англ. cost and freight: товар доставляется до указанного в договоре порта назначения покупателя, страховку основной перевозки, разгрузку и перевалку оплачивает покупатель. Версия Инкотермс 2020."]
[null,"Высоцк","RUVYS",null,"АФГАНИСТАН","Переходное Исламское Государство Афганистан","AFG",null,null,null,"CIF","CIF — англ. cost, Insurance and Freight: то же, что CFR, но основную перевозку страхует продавец. Версия Инкотермс 2020."]
[null,"Геленджик","RUGDZ",null,"БАГАМЫ","Содружество Багамы","BHS",null,"—","Любой","Иной базис","Иной базис — если ни одно из перечисленных определений Инкотермс не подходит."]
[null,"Де Кастри ","RUDKA",null,"БАНГЛАДЕШ","Народная Республика Бангладеш","BGD"]
[null,"Диксон","RUDKS",null,"БАРБАДОС","Барбадос","BRB"]
[null,"Дудинка","RUDUD",null,"БАХРЕЙН","Королевство Бахрейн","BHR"]
[null,"Ейск","YEYSK",null,"БЕЛАРУСЬ","Республика Беларусь","BLR"]
[null,"Зарубино","RUZAR",null,"БЕЛИЗ","Белиз","BLZ"]
[null,"Кавказ","RUKZP",null,"БЕЛЬГИЯ","Королевство Бельгия","BEL"]
[null,"Калининград","RUKGD",null,"БЕНИН","Республика Бенин","BEN"]
[null,"Кандалакша","RUKAN",null,"БЕРМУДЫ","Бермудские Острова","BMU"]
[null,"Керчь","RUKEH",null,"БОЛГАРИЯ","Республика Болгария","BGR"]
[null,"Козьмино","RUKOZ",null,"БОЛИВИЯ","Многонациональное Государство Боливия","BOL"]
[null,"Корсаков","RUKOR",null,"БОСНИЯ И ГЕРЦЕГОВИНА","Босния и Герцеговина","BIH"]
[null,"Красногорский морской порт","RUKRS",null,"БОТСВАНА","Республика Ботсвана","BWA"]
[null,"Курильск","RUSVK",null,"БРАЗИЛИЯ","Федеративная Республика Бразилия","BRA"]
[null,"Ломоносов","RULOM",null,"БРИТ.ТЕР. В ИНД.ОКЕАНЕ","Британская территория в Индийском океане (Брит.)","IOT"]
[null,"Магадан порт ","RUGDX",null,"БРУНЕЙ-ДАРУССАЛАМ","Бруней-Даруссалам","BRN"]
[null,"Махачкала","RUMCX",null,"БУРКИНА-ФАСО","Буркина-Фасо","BFA"]
[null,"Москальво","RUMVO",null,"БУРУНДИ","Республика Бурунди","BDI"]
[null,"Мурманск","RUMMK",null,"БУТАН","Королевство Бутан","BTN"]
[null,"Мыс Лазарева","RULAZ",null,"ВАНУАТУ","Республика Вануату","VUT"]
[null,"Нарьян-Мар","RUNNM",null,"ВЕНГРИЯ","Венгерская Республика","HUN"]
[null,"Находка","RUNJK",null,"ВЕНЕСУЭЛА","Боливарианская республика Венесуэла","VEN"]
[null,"Невельск","RUNEV",null,"ВИРГИНСКИЕ ОСТР.,БРИТ.","Британские Виргинские острова","VGB"]
[null,"Николаевск-на-Амуре","RUNIA",null,"ВИРГИНСКИЕ ОСТРОВА,США","Виргинские острова Соединенных Штатов","VIR"]
[null,"Новороссийск","RUNVS",null,"ВЬЕТНАМ","Социалистическая Республика Вьетнам","VNM"]
[null,"Оля","RUOYA",null,"ГАБОН","Габонская Республика","GAB"]
[null,"Охотск","RUOHO",null,"ГАИТИ","Республика Гаити","HTI"]
[null,"Певек","RUPWE",null,"ГАЙАНА","Республика Гайана","GUY"]
[null,"Петропавловск-Камчатск","RUPKC",null,"ГАМБИЯ","Республика Гамбия","GMB"]
[null,"Посьет","RUPSE",null,"ГАНА","Республика Гана","GHA"]
[null,"Приморск","RUPRI",null,"ГВАДЕЛУПА","Гваделупа (Фр.)","GLP"]
[null,"Провидения","RUPVS",null,"ГВАТЕМАЛА","Республика Гватемала","GTM"]
[null,"Ростов-на-Дону","RUROV",null,"ГВИНЕЯ","Гвинейская Республика","GIN"]
[null,"Сабетта","RUSAB",null,"ГВИНЕЯ-БИСАУ","Республика Гвинея-Бисау","GNB"]
[null,"Санкт-Петербургский морской порт","RULED",null,"ГЕРМАНИЯ","Федеративная Республика Германия","DEU"]
[null,"Советская Гавань","RUSOG",null,"ГЕРНСИ","Гернси","GGY"]
[null,"Таганрог","RUTAG",null,"ГИБРАЛТАР","Гибралтар (Брит.)","GIB"]
[null,"Тамань","RUTAM",null,"ГОНДУРАС","Республика Гондурас","HND"]
[null,"Темрюк","RUTMR",null,"ГОНКОНГ","Специальный административный регион Китая Гонконг","HKG"]
[null,"Туапсе","RUTUA",null,"ГРЕНАДА","Гренада","GRD"]
[null,"Усть-Луга","RUULU",null,"ГРЕНЛАНДИЯ","Гренландия (в составе Дании)","GRL"]
[null,"Ялта","RUYAL",null,"ГРЕЦИЯ","Греческая Республика","GRC"]
[null,"Иной порт","XXXX",null,"ГРУЗИЯ","Республика Грузия","GEO"]
[null,null,null,null,"ГУАМ","Гуам (США)","GUM"]
[null,null,null,null,"ДАНИЯ","Королевство Дания","DNK"]
[null,null,null,null,"ДЖЕРСИ","Джерси","JEY"]
[null,null,null,null,"ДЖИБУТИ","Республика Джибути","DJI"]
[null,null,null,null,"ДОМИНИКА","Содружество Доминики","DMA"]
[null,null,null,null,"ДОМИНИКАНСКАЯ РЕСПУБ.","Доминиканская республика","DOM"]
[null,null,null,null,"ЕГИПЕТ","Арабская Республика Египет","EGY"]
[null,null,null,null,"ЗАПАДНАЯ САХАРА","Западная Сахара","ESH"]
[null,null,null,null,"ЗИМБАБВЕ","Республика Зимбабве","ZWE"]
[null,null,null,null,"ИЗРАИЛЬ","Государство Израиль","ISR"]
[null,null,null,null,"ИНДИЯ","Республика Индия","IND"]
[null,null,null,null,"ИНДОНЕЗИЯ","Республика Индонезия","IDN"]
[null,null,null,null,"ИОРДАНИЯ","Иорданское Хашимитское Королевство","JOR"]
[null,null,null,null,"ИРАК","Республика Ирак","IRQ"]
[null,null,null,null,"ИРАН,ИСЛАМСКАЯ РЕСПУБ.","Исламская Республика Иран","IRN"]
[null,null,null,null,"ИРЛАНДИЯ","Ирландия","IRL"]
[null,null,null,null,"ИСЛАНДИЯ","Республика Исландия","ISL"]
[null,null,null,null,"ИСПАНИЯ","Королевство Испания","ESP"]
[null,null,null,null,"ИТАЛИЯ","Итальянская Республика","ITA"]
[null,null,null,null,"ЙЕМЕН","Йеменская Республика","YEM"]
[null,null,null,null,"КАБО-ВЕРДЕ","Республика Кабо-Верде","CPV"]
[null,null,null,null,"КАЗАХСТАН","Республика Казахстан","KAZ"]
[null,null,null,null,"КАМБОДЖА","Королевство Камбоджа","KHM"]
[null,null,null,null,"КАМЕРУН","Республика Камерун","CMR"]
[null,null,null,null,"КАНАДА","Канада","CAN"]
[null,null,null,null,"КАТАР","Государство Катар","QAT"]
[null,null,null,null,"КЕНИЯ","Республика Кения","KEN"]
[null,null,null,null,"КИПР","Республика Кипр","CYP"]
[null,null,null,null,"КИРГИЗИЯ","Киргизская Республика","KGZ"]
[null,null,null,null,"КИРИБАТИ","Республика Кирибати","KIR"]
[null,null,null,null,"КИТАЙ","Китайская Народная Республика","CHN"]
[null,null,null,null,"КОКОСОВЫЕ(КИЛИНГ)ОСТР.","Кокосовые (Килинг) Острова (в составе Австралии)","CCK"]
[null,null,null,null,"КОЛУМБИЯ","Республика Колумбия","COL"]
[null,null,null,null,"КОМОРЫ","Союз Коморы","COM"]
[null,null,null,null,"КОНГО","Республика Конго","COG"]
[null,null,null,null,"КОНГО,ДЕМОКРАТ.РЕСПУБ.","Демократическая Республика Конго","COD"]
[null,null,null,null,"КОРЕЙСКАЯ НДР","Корейская Народно-Демократическая Республика","PRK"]
[null,null,null,null,"КОРЕЯ, РЕСПУБЛИКА","Республика Корея","KOR"]
[null,null,null,null,"КОСТА-РИКА","Республика Коста-Рика","CRI"]
[null,null,null,null,"КОТ Д'ИВУАР","Республика Кот д'Ивуар","CIV"]
[null,null,null,null,"КУБА","Республика Куба","CUB"]
[null,null,null,null,"КУВЕЙТ","Государство Кувейт","KWT"]
[null,null,null,null,"ЛАОССКАЯ НДР","Лаосская Народно-Демократическая Республика","LAO"]
[null,null,null,null,"ЛАТВИЯ","Латвийская Республика","LVA"]
[null,null,null,null,"ЛЕСОТО","Королевство Лесото","LSO"]
[null,null,null,null,"ЛИБЕРИЯ","Республика Либерия","LBR"]
[null,null,null,null,"ЛИВАН","Ливанская Республика","LBN"]
[null,null,null,null,"ЛИВИЙС.АРАБ.ДЖАМАХИРИЯ","Социалистическая Народная Ливийская Арабская Джамахирия","LBY"]
[null,null,null,null,"ЛИТВА","Литовская Республика","LTU"]
[null,null,null,null,"ЛИХТЕНШТЕЙН","Княжество Лихтенштейн","LIE"]
[null,null,null,null,"ЛЮКСЕМБУРГ","Великое Герцогство Люксембург","LUX"]
[null,null,null,null,"М.ТИХООК.ОТДАЛ.ОСТРОВА","Малые Тихоокеанские Отдаленные Острова (США)","UMI"]
[null,null,null,null,"МАВРИКИЙ","Республика Маврикий","MUS"]
[null,null,null,null,"МАВРИТАНИЯ","Исламская Республика Мавритания","MRT"]
[null,null,null,null,"МАДАГАСКАР","Республика Мадагаскар","MDG"]
[null,null,null,null,"МАЙОТТА","Майотта","MYT"]
[null,null,null,null,"МАКАО","Специальный административный регион Китая Макао","MAC"]
[null,null,null,null,"МАКЕДОНИЯ","Республика Македония","MKD"]
[null,null,null,null,"МАЛАВИ","Республика Малави","MWI"]
[null,null,null,null,"МАЛАЙЗИЯ","Малайзия","MYS"]
[null,null,null,null,"МАЛИ","Республика Мали","MLI"]
[null,null,null,null,"МАЛЬДИВЫ","Мальдивская Республика","MDV"]
[null,null,null,null,"МАЛЬТА","Республика Мальта","MLT"]
[null,null,null,null,"МАРОККО","Королевство Марокко","MAR"]
[null,null,null,null,"МАРТИНИКА","Мартиника (Фр.)","MTQ"]
[null,null,null,null,"МАРШАЛЛОВЫ ОСТРОВА","Республика Маршалловы Острова","MHL"]
[null,null,null,null,"МЕКСИКА","Мексиканские Соединенные Штаты","MEX"]
[null,null,null,null,"МИКРОНЕЗИЯ,ФЕДЕР.ШТАТЫ","Федеративные штаты Микронезии","FSM"]
[null,null,null,null,"МОЗАМБИК","Республика Мозамбик","MOZ"]
[null,null,null,null,"МОЛДОВА, РЕСПУБЛИКА","Республика Молдова","MDA"]
[null,null,null,null,"МОНАКО","Княжество Монако","MCO"]
[null,null,null,null,"МОНГОЛИЯ","Монголия","MNG"]
[null,null,null,null,"МОНТСЕРРАТ","Монтсеррат (Брит.)","MSR"]
[null,null,null,null,"МЬЯНМА","Союз Мьянма","MMR"]
[null,null,null,null,"НАМИБИЯ","Республика Намибия","NAM"]
[null,null,null,null,"НАУРУ","Республика Науру","NRU"]
[null,null,null,null,"НЕПАЛ","Королевство Непал","NPL"]
[null,null,null,null,"НИГЕР","Республика Нигер","NER"]
[null,null,null,null,"НИГЕРИЯ","Федеративная Республика Нигерия","NGA"]
[null,null,null,null,"НИДЕРЛАНДЫ","Королевство Нидерландов","NLD"]
[null,null,null,null,"НИКАРАГУА","Республика Никарагуа","NIC"]
[null,null,null,null,"НИУЭ","Республика Ниуэ","NIU"]
[null,null,null,null,"НОВАЯ ЗЕЛАНДИЯ","Новая Зеландия","NZL"]
[null,null,null,null,"НОВАЯ КАЛЕДОНИЯ","Новая Каледония (Фр.)","NCL"]
[null,null,null,null,"НОРВЕГИЯ","Королевство Норвегия","NOR"]
[null,null,null,null,"О.ХЕРД И О.МАКДОНАЛЬД","Херд и Макдональд (в составе Австралии)","HMD"]
[null,null,null,null,"ОБЪЕД. АРАБСК. ЭМИРАТЫ","Объединенные Арабские Эмираты (ОАЭ)","ARE"]
[null,null,null,null,"ОМАН","Султанат Оман","OMN"]
[null,null,null,null,"ОСТРОВ БУВЕ","Остров Буве","BVT"]
[null,null,null,null,"ОСТРОВ МЭН","Остров Мэн","IMN"]
[null,null,null,null,"ОСТРОВ МЭН","Остров Мэн","IMY"]
[null,null,null,null,"ОСТРОВ НОРФОЛК","Норфолк (Австрал.)","NFK"]
[null,null,null,null,"ОСТРОВ РОЖДЕСТВА","Остров Рождества (Австрал.)","CXR"]
[null,null,null,null,"ОСТРОВА КАЙМАН","Острова Кайман","CYM"]
[null,null,null,null,"ОСТРОВА КУКА","Острова Кука (Н.Зел.)","COK"]
[null,null,null,null,"ОСТРОВА ТЕРКС И КАЙКОС","Теркс и Кайкос (Брит.)","TCA"]
[null,null,null,null,"ПАКИСТАН","Исламская Республика Пакистан","PAK"]
[null,null,null,null,"ПАЛАУ","Республика Палау","PLW"]
[null,null,null,null,"ПАЛЕСТИНА, ГОСУДАРСТВО","Государство Палестина","PSE"]
[null,null,null,null,"ПАНАМА","Республика Панама","PAN"]
[null,null,null,null,"ПАПСК.ПРЕСТОЛ(ВАТИКАН)","ПАПСКИЙ ПРЕСТОЛ (ГОСУДАРСТВО-ГОРОД ВАТИКАН)","VAT"]
[null,null,null,null,"ПАПУА НОВАЯ ГВИНЕЯ","Независимое Государство Папуа Новая Гвинея","PNG"]
[null,null,null,null,"ПАРАГВАЙ","Республика Парагвай","PRY"]
[null,null,null,null,"ПЕРУ","Республика Перу","PER"]
[null,null,null,null,"ПИТКЕРН","Питкэрн (Брит.)","PCN"]
[null,null,null,null,"ПОЛЬША","Республика Польша","POL"]
[null,null,null,null,"ПОРТУГАЛИЯ","Португальская Республика","PRT"]
[null,null,null,null,"ПУЭРТО-РИКО","Пуэрто-Рико (США)","PRI"]
[null,null,null,null,"РЕСПУБЛИКА ЗАМБИЯ","Республика Замбия","ZMB"]
[null,null,null,null,"РЕЮНЬОН","Реюньон (Фр.)","REU"]
[null,null,null,null,"РОССИЯ","Российская Федерация","RUS"]
[null,null,null,null,"РУАНДА","Руандийская Республика","RWA"]
[null,null,null,null,"РУМЫНИЯ","Республика Румыния","ROU"]
[null,null,null,null,"САЛЬВАДОР","Республика Эль-Сальвадор","SLV"]
[null,null,null,null,"САМОА","Независимое Государство Самоа","WSM"]
[null,null,null,null,"САН-МАРИНО","Республика Сан-Марино","SMR"]
[null,null,null,null,"САН-ТОМЕ И ПРИНСИПИ","Демократическая Республика Сан-Томе и Принсипи","STP"]
[null,null,null,null,"САУДОВСКАЯ АРАВИЯ","Королевство Саудовская Аравия","SAU"]
[null,null,null,null,"СВАЗИЛЕНД","Королевство Свазиленд","SWZ"]
[null,null,null,null,"СВЯТАЯ ЕЛЕНА","Святая Елена, остров Вознесения, Тристан-да-Кунья","SHN"]
[null,null,null,null,"СЕВЕРН.МАРИАНСКИЕ ОСТР","Содружество Северных Марианских островов","MNP"]
[null,null,null,null,"СЕЙШЕЛЫ","Республика Сейшелы","SYC"]
[null,null,null,null,"СЕН-БАРТЕЛЕМИ","Сен-Бартелеми","BLM"]
[null,null,null,null,"СЕНЕГАЛ","Республика Сенегал","SEN"]
[null,null,null,null,"СЕН-МАРТЕН","Сен-мартен (французская часть)","MAF"]
[null,null,null,null,"СЕН-ПЬЕР И МИКЕЛОН","Сен-Пьер и Микелон (Фр.)","SPM"]
[null,null,null,null,"СЕНТ-ВИНСЕНТ И ГРЕНАД.","Сент-Винсент и Гренадины","VCT"]
[null,null,null,null,"СЕНТ-КИТС И НЕВИС","Федерация Сент-Китс (Сент-Кристофер) и Невис","KNA"]
[null,null,null,null,"СЕНТ-ЛЮСИЯ","Сент-Люсия","LCA"]
[null,null,null,null,"СЕРБИЯ","Сербия","SRB"]
[null,null,null,null,"СЕРБИЯ И ЧЕРНОГОРИЯ","СЕРБИЯ И ЧЕРНОГОРИЯ (устар.)","SCG"]
[null,null,null,null,"СИНГАПУР","Республика Сингапур","SGP"]
[null,null,null,null,"СИРИЙСКАЯ АРАБ.РЕСПУБ.","Сирийская Арабская Республика","SYR"]
[null,null,null,null,"СЛОВАКИЯ","Словацкая Республика","SVK"]
[null,null,null,null,"СЛОВЕНИЯ","Республика Словения","SVN"]
[null,null,null,null,"СОЕДИНЕН.КОРОЛЕВСТВО","Соединенное Королевство Великобритании и Северной Ирландии","GBR"]
[null,null,null,null,"СОЕДИНЕННЫЕ ШТАТЫ","Соединенные Штаты Америки","USA"]
{"$rows_left_out":54}